{"text_format":"1","workbook":"xlsx","n_sheets":16,"sheets":["Tasas EG","Asistencia Funeraria","Enfermedades Graves","Tasa AP Familiar","AP Familiar","AP Individual","AP Colectivo","AP PTA (Asiento)","AP Escolar","Crucero","AP Viajero","Colectivo de Vida","Saldo Deudor","Coberturas AP - CV","Calculador","CSG1960"],"not_rendered":{"charts":0,"images":1,"macros":1,"external_links":0,"defined_names":87,"comments":3,"pivot_tables":0},"unopened":[],"bounds":{"document_bytes":16777216,"sheet_cells":100000,"rows_first":2000,"rows_last":500,"rows_between":2000,"halvings":0,"cell_chars":16384,"cell_head_chars":4096},"cells_cut":0,"cells_raw":0,"read":"whole","date_system":"1900"}

{"sheet":"Tasas EG","index":0,"n_rows":55,"n_cols":10,"rows_kept":55,"cut":false,"hidden":true,"merged":[[0,0,0,2],[0,4,0,6]]}
["Por Edad Alcanzada",null,null,null,"Por Rango de Edad"]
["Edad","Hombre","Mujer",null,"Rango Edad","Hombre","Mujer",null,"Costo Fijo",21.71]
[18,0.68069999999999997,0.68689999999999996,null,18,0.88160000000000005,0.93310000000000004]
[19,0.68069999999999997,0.68689999999999996,null,19,0.88160000000000005,0.93310000000000004]
[20,0.68069999999999997,0.68689999999999996,null,20,0.88160000000000005,0.93310000000000004]
[21,0.75209999999999999,0.75880000000000003,null,21,0.88160000000000005,0.93310000000000004]
[22,0.82789999999999997,0.81910000000000005,null,22,0.88160000000000005,0.93310000000000004]
[23,0.87519999999999998,0.92020000000000002,null,23,0.88160000000000005,0.93310000000000004]
[24,0.96519999999999995,1.0190999999999999,null,24,0.88160000000000005,0.93310000000000004]
[25,1.0228999999999999,1.1403000000000001,null,25,0.88160000000000005,0.93310000000000004]
{"$rows_left_out":46}
{"sheet":"Asistencia Funeraria","index":1,"n_rows":61,"n_cols":16,"rows_kept":61,"cut":false,"hidden":true,"merged":[[11,2,11,4],[16,0,16,5],[17,0,17,5],[13,0,13,1],[11,0,11,1],[15,0,15,6],[9,0,9,1],[0,3,3,6],[5,0,5,7],[7,0,7,1],[7,2,7,4],[7,6,7,7]]}
[null,null,null,"Asistencia Funeraria"]
[]
[]
[]
[null,null,null,null,null,"drojas","CUMPLI02","Comercial_13122017"]
["Datos Generales"]
[]
["Solicitante:",null,"<Nombre del Solicitante>",null,null,"Corredor:","<Corredor del Solicitante>"]
[]
["Edad:",null,45,null,null,"Fecha:",{"$f":"TODAY()","v":"2018-07-26"}]
{"$rows_left_out":52}
{"sheet":"Enfermedades Graves","index":2,"n_rows":26,"n_cols":24,"rows_kept":26,"cut":false,"hidden":true,"merged":[[0,4,3,9],[5,0,5,9],[7,0,7,1],[7,2,7,4],[13,0,13,1],[13,5,13,6],[16,7,16,9],[17,7,17,9],[7,7,7,9],[9,7,9,9],[9,2,9,3],[15,0,15,9],[16,0,16,6],[17,0,17,6],[9,0,9,1],[11,0,11,1],[9,4,9,5]]}
[null,null,null,null,"Enfermedades Graves"]
[]
[]
[]
[null,null,null,null,null,null,null,null,"drojas","CUMPLI02","Comercial_07112017"]
["Datos Generales"]
[]
["Solicitante:",null,"<Nombre del Solicitante>",null,null,null,"Ocupación:","<Ocupación del Solicitante>"]
[]
["Esquema de Tarifa:",null,"Rango de Edad",null,{"$f":"IF(C10=\"Rango de Edad\", IF(C12<26, \"18 - 25 AÑOS\", IF(C12<31, \"26 - 30 AÑOS\", IF(C12<36, \"31 - 35 AÑOS\", IF(C12<41, \"36 - 40 AÑOS\", IF(C12<46, \"41 - 45 AÑOS\", IF(C12<51, \"46 - 50 AÑOS\", IF(C12<56, \"51 - 55 AÑOS\", IF(C12<61, \"56 - 60 AÑOS\", IF(C12<66, \"61 - 65 AÑOS\", \"66 - 70 AÑOS\"))))))))),\"\")","v":"41 - 45 AÑOS"},null,"Corredor:","<Corredor del Solicitante>"]
{"$rows_left_out":17}
{"sheet":"Tasa AP Familiar","index":3,"n_rows":6,"n_cols":11,"rows_kept":6,"cut":false,"hidden":true,"merged":[]}
[null,{"$f":"+'AP Familiar'!I16","v":100000},{"$f":"+VLOOKUP(B1,$J$2:$K$6,2,FALSE)","v":4}]
[null,null,null,null,null,null,null,null,null,25000,2]
[null,null,25,50,100,150,200,null,null,50000,3]
[null,"Asegurado y Cónyuge",80.81,118.16,192.87,267.57,342.28,null,null,100000,4]
[null,"Asegurado e Hijos",68.88,94.65,146.19,197.73,249.28,null,null,150000,5]
[null,"Asegurado Cónyuge e Hijos",109.28,153.72999999999999,242.63,331.52,420.42,null,null,200000,6]

{"sheet":"AP Familiar","index":4,"n_rows":35,"n_cols":23,"rows_kept":35,"cut":false,"hidden":true,"merged":[[26,0,30,6],[14,8,14,9],[15,8,15,9],[16,8,16,9],[17,8,17,9],[18,8,18,9],[19,8,19,9],[20,8,20,9],[16,0,16,6],[17,0,17,6],[21,8,21,9],[23,8,23,9],[22,0,22,6],[22,8,22,9],[25,0,25,6],[11,2,11,4],[5,0,5,9],[15,0,15,6],[11,0,11,1],[13,0,13,9],[14,0,14,6],[0,4,3,9],[7,0,7,1],[7,2,7,4],[7,7,7,9],[9,0,9,1]]}
[null,null,null,null,"Accidentes Personales Familiar"]
[]
[]
[]
[null,null,null,null,null,null,null,"drojas","CUMPLI02","28082017v8","Comercial_07112017"]
["Datos Generales"]
[]
["Solicitante:",null,"<Nombre del Solicitante>",null,null,null,"Corredor:","<Corredor del Solicitante>"]
[]
["Edad del Solicitante:",null,50,null,null,null,"Fecha:",{"$f":"TODAY()","v":"2018-07-26"}]
{"$rows_left_out":26}
{"sheet":"AP Individual","index":5,"n_rows":46,"n_cols":29,"rows_kept":46,"cut":false,"hidden":false,"merged":[[35,0,35,6],[36,0,36,6],[37,0,37,6],[38,0,38,6],[35,7,35,8],[36,7,36,8],[37,7,37,8],[38,7,38,8],[27,7,27,8],[28,7,28,8],[29,7,29,8],[30,7,30,8],[22,7,22,8],[23,7,23,8],[24,7,24,8],[25,7,25,8],[26,7,26,8],[20,7,20,8],[17,7,17,8],[18,7,18,8],[16,7,16,8],[21,7,21,8],[28,0,28,6],[34,0,34,6],[0,4,3,10],[9,8,9,10],[5,0,5,10],[7,0,7,1],[9,0,9,1],[7,2,7,4],[7,6,7,7],[7,8,7,10],[9,6,9,7],[11,6,11,7],[15,0,15,10],[11,0,11,1],[16,0,16,6],[19,7,19,8],[34,7,34,8],[31,0,31,6],[32,0,32,6],[33,0,33,6],[31,7,31,8],[13,0,13,1],[29,0,29,6],[30,0,30,6],[32,7,32,8],[33,7,33,8],[17,0,17,6],[18,0,18,6],[19,0,19,6],[20,0,20,6],[21,0,21,6],[22,0,22,6],[23,0,23,6],[24,0,24,6],[25,0,25,6],[26,0,26,6],[27,0,27,6]]}
[null,null,null,null,"Accidentes Personales - Plan Individual"]
[]
[]
[]
[null,null,null,null,null,null,null,null,null,"ahill","VIDA05","Comercial_13122017"]
["Datos Generales"]
[]
["Solicitante:",null,"<Nombre del Solicitante>",null,null,null,"Ocupación:",null,"<Ocupación del Solicitante>"]
[]
["Días de Cobertura:",null,365,null,null,null,"Corredor:",null,"<Corredor del Solicitante>"]
{"$rows_left_out":37}
{"sheet":"AP Colectivo","index":6,"n_rows":73,"n_cols":18,"rows_kept":73,"cut":false,"hidden":false,"merged":[[27,0,27,4],[28,0,28,4],[29,0,29,4],[30,0,30,4],[5,0,5,7],[7,0,7,1],[13,0,13,1],[23,0,23,4],[21,0,21,4],[22,0,22,4],[16,0,16,4],[17,0,17,4],[18,0,18,4],[15,0,15,7],[25,0,25,4],[26,0,26,4],[24,0,24,4],[19,0,19,4],[20,0,20,4],[0,3,3,8],[7,6,7,8],[7,2,7,4],[9,0,9,1],[11,0,11,1],[9,6,9,8]]}
[null,null,null,"Accidentes Personales - Plan Colectivo"]
[]
[]
[]
[null,null,null,null,null,null,"ahill","VIDA05","Comercial_13122017"]
["Datos Generales"]
[]
["Solicitante:",null,"<Nombre del Solicitante>",null,null,"Ocupación:","<Ocupación del Solicitante>"]
[]
["Edad Promedio:",null,40,null,null,"Corredor:","<Corredor del Solicitante>"]
{"$rows_left_out":64}
{"sheet":"AP PTA (Asiento)","index":7,"n_rows":36,"n_cols":17,"rows_kept":36,"cut":false,"hidden":false,"merged":[[31,5,31,6],[28,5,28,6],[29,5,29,6],[30,5,30,6],[28,0,28,4],[29,0,29,4],[30,0,30,4],[31,0,31,4],[25,0,25,8],[26,0,26,4],[26,5,26,6],[27,5,27,6],[27,0,27,4],[18,5,18,6],[19,5,19,6],[17,5,17,6],[17,0,17,4],[18,0,18,4],[19,0,19,4],[16,5,16,6],[9,0,9,1],[9,6,9,8],[11,0,11,1],[13,0,13,8],[14,0,14,4],[14,5,14,6],[15,5,15,6],[15,0,15,4],[16,0,16,4],[5,0,5,8],[7,0,7,1],[7,6,7,7],[0,3,3,9],[7,2,7,3]]}
[null,null,null,"Accidentes Personales - PTA (Asiento)"]
[]
[]
[]
[null,null,null,null,null,null,null,"drojas","CUMPLI02","Comercial_13122017"]
["Datos Generales"]
[null,null,null,null,null,null,null,null,null,null,null,null,null,null,null,null,"Transporte Público Uber"]
["Solicitante:",null,"<Nombre del Solicitante>",null,null,"Vehiculo:","Transporte Público Provincial",null,null,null,null,null,null,null,null,null,"Transporte Público Provincial"]
[null,null,null,null,null,null,null,null,null,null,null,null,null,null,null,null,"Transporte Público Ruta Interna"]
["Cantidad de Pasajeros:",null,15,"* sin considerar el conductor",null,"Corredor:","<Corredor del Solicitante>",null,null,null,null,null,null,null,null,null,"Transporte Público Vehiculo Modificado"]
{"$rows_left_out":27}
{"sheet":"AP Escolar","index":8,"n_rows":61,"n_cols":18,"rows_kept":61,"cut":false,"hidden":false,"merged":[[19,0,19,4],[9,0,9,1],[0,3,3,8],[5,0,5,7],[7,0,7,1],[7,2,7,4],[7,6,7,8],[17,0,17,4],[18,0,18,4],[11,0,11,1],[13,0,13,7],[14,0,14,4],[15,0,15,4],[16,0,16,4]]}
[null,null,null,"Accidentes Personales - Plan Escolar"]
[]
[]
[]
[null,null,null,null,null,null,"drojas","CUMPLI02","Comercial_13122017"]
["Datos Generales"]
[]
["Colegio:",null,"<Nombre del Colegio Solicitante>",null,null,"Corredor:","<Corredor del Solicitante>"]
[]
["Cantidad de Estudiantes:",null,100,null,null,"Cantidad de Administrativos:",5]
{"$rows_left_out":52}
{"sheet":"Crucero","index":9,"n_rows":59,"n_cols":20,"rows_kept":59,"cut":false,"hidden":true,"merged":[[9,0,9,1],[9,6,9,8],[0,3,3,8],[5,0,5,7],[7,0,7,1],[7,2,7,4],[7,6,7,8],[17,0,17,4],[18,0,18,4],[11,0,11,1],[13,0,13,7],[14,0,14,4],[15,0,15,4],[16,0,16,4]]}
[null,null,null,"Accidentes Personales - Crucero"]
[]
[]
[]
[null,null,null,null,null,null,"drojas","CUMPLI02","Comercial_07112017"]
["Datos Generales"]
[]
["Solicitante:",null,"<Nombre del Solicitante>",null,null,"Línea de Crucero:","<Linea del Crucero a Utilizar>"]
[]
["Edad:",null,25,null,null,"Corredor:","<Corredor del Solicitante>"]
{"$rows_left_out":50}
{"sheet":"AP Viajero","index":10,"n_rows":58,"n_cols":16,"rows_kept":58,"cut":false,"hidden":false,"merged":[[0,3,3,6],[7,0,7,1],[7,2,7,4],[9,0,9,1],[18,0,18,4],[7,6,7,7],[5,0,5,7],[11,0,11,1],[13,0,13,6],[14,0,14,4],[15,0,15,4],[16,0,16,4],[17,0,17,4]]}
[null,null,null,"Accidentes Personales - Viajero"]
[]
[]
[]
[null,null,null,null,null,"drojas","CUMPLI02","Comercial_13122017"]
["Datos Generales"]
[]
["Solicitante:",null,"<Nombre del Solicitante>",null,null,"Corredor:","<Corredor del Solicitante>"]
[]
["Edad:",null,30,null,null,"Suma Asegurada:",150000]
{"$rows_left_out":49}
{"sheet":"Colectivo de Vida","index":11,"n_rows":42,"n_cols":27,"rows_kept":42,"cut":false,"hidden":false,"merged":[[33,0,33,5],[33,6,33,7],[13,0,13,1],[28,0,28,5],[28,6,28,7],[23,0,23,5],[23,6,23,7],[24,0,24,5],[24,6,24,7],[20,0,20,5],[20,6,20,7],[21,0,21,5],[21,6,21,7],[22,0,22,5],[22,6,22,7],[15,0,15,9],[16,0,16,5],[16,6,16,7],[29,0,29,5],[29,6,29,7],[34,0,34,5],[34,6,34,7],[25,0,25,5],[25,6,25,7],[26,0,26,5],[26,6,26,7],[27,0,27,5],[27,6,27,7],[30,0,30,5],[30,6,30,7],[31,0,31,5],[31,6,31,7],[32,0,32,5],[32,6,32,7],[17,0,17,5],[17,6,17,7],[19,0,19,5],[19,6,19,7],[18,0,18,5],[18,6,18,7],[9,0,9,1],[9,5,9,6],[9,7,9,9],[11,0,11,1],[11,5,11,6],[0,4,3,9],[5,0,5,9],[7,0,7,1],[7,2,7,4],[7,5,7,6],[7,7,7,9]]}
[null,null,null,null,"Colectivo de Vida - Grupo"]
[]
[]
[]
[null,null,null,null,null,null,null,null,"drojas","CUMPLI02","Comercial_13122017",null,null,null,null,null,null,null,null,null,null,null,null,null,null,null,"Servicio de Emergencia Odontológica sin Endodoncia"]
["Datos Generales",null,null,null,null,null,null,null,null,null,null,null,null,null,null,null,null,null,null,null,null,null,null,null,null,null,"Servicio de Emergencia Odontológica Completa"]
[null,null,null,null,null,null,null,null,null,null,null,null,null,null,null,null,null,null,null,null,null,null,null,null,null,null,"Servicio de Emergencia Odontológica Completa + Prevención"]
["Solicitante:",null,"<Nombre del Solicitante>",null,null,"Ocupación:",null,"<Ocupación del Solicitante>",null,null,null,null,null,null,null,null,null,null,null,null,null,null,null,null,null,null,"Servicio Odontológico Amplio sin Endodoncia"]
[null,null,null,null,null,null,null,null,null,null,null,null,null,null,null,null,null,null,null,null,null,null,null,null,null,null,"Servicio Odontológico Amplio"]
["Edad Promedio:",null,40,null,null,"Corredor:",null,"<Corredor del Solicitante>",null,null,null,null,null,null,null,null,null,null,null,null,null,null,null,null,null,null,"Servicio de Emergencia Odontológica sin Endodoncia Familiar"]
{"$rows_left_out":33}
{"sheet":"Saldo Deudor","index":12,"n_rows":32,"n_cols":7,"rows_kept":32,"cut":false,"hidden":true,"merged":[[13,0,13,1],[7,0,7,1],[7,2,7,4],[5,0,5,6],[0,3,3,6],[9,0,9,1],[11,0,11,1],[25,0,25,4],[26,0,26,4],[27,0,27,4],[22,0,22,4],[23,0,23,4],[24,0,24,4],[19,0,19,4],[20,0,20,4],[21,0,21,4],[15,0,15,5],[16,0,16,4],[17,0,17,4],[18,0,18,4]]}
[null,null,null,"Colectivo de Vida - Saldo Deudor"]
[]
[]
[]
[null,null,null,null,"drojas","CUMPLI02","Comercial_07112017"]
["Datos Generales"]
[]
["Solicitante:",null,"<Nombre del Solicitante>",null,null,"Ocupación:","<Ocupación del Solicitante>"]
[]
["Edad Promedio:",null,30,null,null,"Corredor:","<Corredor del Solicitante>"]
{"$rows_left_out":23}
{"sheet":"Coberturas AP - CV","index":13,"n_rows":732,"n_cols":30,"rows_kept":732,"cut":false,"hidden":true,"merged":[]}
["Concatenado","Cobertura","Suma Asegurada Mínima","Suma Asegurada Máxima","Suma Asegurada Fija","Exposición Fija","Edad Mínima","Edad Máxima","Edad Permanencia","Producto","Ramo Subramo","Ramo","Rol","Tasa Anual por Millar","Prima Anual Fija","Deducible","Indemnización Máxima","Clasificación Riesgo","Tipo de Beneficio","Observaciones"]
[{"$f":"+Tabla1[[#This Row],[Producto]]&Tabla1[[#This Row],[Cobertura]]&Tabla1[[#This Row],[Edad Mínima]]&Tabla1[[#This Row],[Clasificación Riesgo]]","v":"AP IndividualMuerte Accidental17A"},"Muerte Accidental",1000,1580000,0,0,17,60,75,"AP Individual","0703 - Plan Normal","07 - Accidentes Personales",0,1,0,0,0,"A","Básico"]
[{"$f":"+Tabla1[[#This Row],[Producto]]&Tabla1[[#This Row],[Cobertura]]&Tabla1[[#This Row],[Edad Mínima]]&Tabla1[[#This Row],[Clasificación Riesgo]]","v":"AP IndividualMuerte Accidental17B"},"Muerte Accidental",1000,1580000,0,0,17,60,75,"AP Individual","0703 - Plan Normal","07 - Accidentes Personales",0,1.6,0,0,0,"B","Básico"]
[{"$f":"+Tabla1[[#This Row],[Producto]]&Tabla1[[#This Row],[Cobertura]]&Tabla1[[#This Row],[Edad Mínima]]&Tabla1[[#This Row],[Clasificación Riesgo]]","v":"AP IndividualMuerte Accidental17C"},"Muerte Accidental",1000,1580000,0,0,17,60,75,"AP Individual","0703 - Plan Normal","07 - Accidentes Personales",0,2.2000000000000002,0,0,0,"C","Básico"]
[{"$f":"+Tabla1[[#This Row],[Producto]]&Tabla1[[#This Row],[Cobertura]]&Tabla1[[#This Row],[Edad Mínima]]&Tabla1[[#This Row],[Clasificación Riesgo]]","v":"AP IndividualMuerte Accidental61A"},"Muerte Accidental",1000,1580000,0,0,61,70,75,"AP Individual","0703 - Plan Normal","07 - Accidentes Personales",0,1.6,0,0,0,"A","Básico"]
[{"$f":"+Tabla1[[#This Row],[Producto]]&Tabla1[[#This Row],[Cobertura]]&Tabla1[[#This Row],[Edad Mínima]]&Tabla1[[#This Row],[Clasificación Riesgo]]","v":"AP IndividualMuerte Accidental61B"},"Muerte Accidental",1000,1580000,0,0,61,70,75,"AP Individual","0703 - Plan Normal","07 - Accidentes Personales",0,2.2999999999999998,0,0,0,"B","Básico"]
[{"$f":"+Tabla1[[#This Row],[Producto]]&Tabla1[[#This Row],[Cobertura]]&Tabla1[[#This Row],[Edad Mínima]]&Tabla1[[#This Row],[Clasificación Riesgo]]","v":"AP IndividualMuerte Accidental61C"},"Muerte Accidental",1000,1580000,0,0,61,70,75,"AP Individual","0703 - Plan Normal","07 - Accidentes Personales",0,3.25,0,0,0,"C","Básico"]
[{"$f":"+Tabla1[[#This Row],[Producto]]&Tabla1[[#This Row],[Cobertura]]&Tabla1[[#This Row],[Edad Mínima]]&Tabla1[[#This Row],[Clasificación Riesgo]]","v":"AP IndividualMuerte Accidental71A"},"Muerte Accidental",1000,100000,0,0,71,75,75,"AP Individual","0703 - Plan Normal","07 - Accidentes Personales",0,1.65,0,0,0,"A","Básico"]
[{"$f":"+Tabla1[[#This Row],[Producto]]&Tabla1[[#This Row],[Cobertura]]&Tabla1[[#This Row],[Edad Mínima]]&Tabla1[[#This Row],[Clasificación Riesgo]]","v":"AP IndividualMuerte Accidental71B"},"Muerte Accidental",1000,100000,0,0,71,75,75,"AP Individual","0703 - Plan Normal","07 - Accidentes Personales",0,2.4,0,0,0,"B","Básico"]
[{"$f":"+Tabla1[[#This Row],[Producto]]&Tabla1[[#This Row],[Cobertura]]&Tabla1[[#This Row],[Edad Mínima]]&Tabla1[[#This Row],[Clasificación Riesgo]]","v":"AP IndividualMuerte Accidental71C"},"Muerte Accidental",1000,100000,0,0,71,75,75,"AP Individual","0703 - Plan Normal","07 - Accidentes Personales",0,3,0,0,0,"C","Básico"]
{"$rows_left_out":723}
{"sheet":"Calculador","index":14,"n_rows":54,"n_cols":37,"rows_kept":54,"cut":false,"hidden":true,"merged":[[55,1,55,6],[43,1,43,5],[44,1,44,5],[45,1,45,5],[46,1,46,5],[47,1,47,5],[48,1,48,5],[49,1,49,5],[50,1,50,5],[51,1,51,5],[52,1,52,5],[53,1,53,5],[41,1,41,2],[46,21,46,26],[1,30,1,36],[3,30,3,31],[4,30,4,31],[5,30,5,31],[7,30,7,34],[8,30,8,34],[9,30,9,34],[10,30,10,34],[11,30,11,34],[12,30,12,34],[13,30,13,34],[40,21,40,26],[41,21,41,26],[38,21,38,26],[30,21,30,22],[31,21,31,22],[32,21,32,22],[34,21,34,26],[28,11,28,17],[30,11,30,15],[31,11,31,15],[32,11,32,15],[33,11,33,15],[37,1,37,7],[39,1,39,2],[40,1,40,2],[30,1,30,5],[31,1,31,5],[32,1,32,5],[33,1,33,5],[13,21,13,25],[28,1,28,7],[28,21,28,27],[8,21,8,25],[9,21,9,25],[10,21,10,25],[11,21,11,25],[12,21,12,25],[14,1,14,7],[15,1,15,7],[16,1,16,7],[17,1,17,7],[18,1,18,7],[19,1,19,7],[20,1,20,7],[21,1,21,7],[1,21,1,27],[3,21,3,22],[4,21,4,22],[5,21,5,22],[7,21,7,25],[5,1,5,2],[13,1,13,7],[7,1,7,7],[8,1,8,7],[9,1,9,7],[10,1,10,7],[11,1,11,7],[12,1,12,7],[22,1,22,7],[23,1,23,7],[13,11,13,15],[1,11,1,17],[3,11,3,12],[4,11,4,12],[5,11,5,12],[7,11,7,15],[8,11,8,15],[9,11,9,15],[10,11,10,15],[11,11,11,15],[12,11,12,15],[1,1,1,7],[3,1,3,2],[4,1,4,2]]}
[]
[null,"AP Individual",null,null,null,null,null,null,null,null,null,"Colectivo de AP",null,null,null,null,null,null,null,null,null,"PTA (Asiento)",null,null,null,null,null,null,null,null,"Crucero"]
[null,"Datos",null,null,null,null,null,null,null,null,null,"Datos",null,null,null,null,null,null,null,null,null,"Datos",null,null,null,null,null,null,null,null,"Datos"]
[null,"Días de Cobertura:",null,{"$f":"+'AP Individual'!C10","v":365},null,null,null,null,null,null,null,"Edad Promedio:",null,{"$f":"+'AP Colectivo'!C10","v":40},null,null,null,null,null,null,null,"Edad Promedio:",null,{"$f":"+'AP Colectivo'!M10","v":0},null,null,null,null,null,null,"Edad:",null,{"$f":"+Crucero!C10","v":25},{"$f":"+IF(AND(AG4>=17,AG4<60),17,IF(AND(AG4>=61,AG4<70),61,IF(AND(Calculador!AG4>=71,Calculador!AG4<75),71,\"\")))","v":17}]
[null,"Edad:",null,{"$f":"+'AP Individual'!C12","v":20},null,null,null,null,null,null,null,"Clasificación:",null,{"$f":"+'AP Colectivo'!C12","v":"B"},null,null,null,null,null,null,null,"Clasificación:",null,{"$f":"+'AP Colectivo'!M12","v":0},null,null,null,null,null,null,"Días de Cobertura",null,{"$f":"+Crucero!C12","v":3}]
[null,"Clasificación:",null,{"$f":"+'AP Individual'!C14","v":"C"},null,null,null,null,null,null,null,"Cantidad de Asegurados:",null,{"$f":"+'AP Colectivo'!C14","v":50},null,"Días de Cobertura:",null,{"$f":"+'AP Colectivo'!G14","v":365},null,null,null,"Cantidad de Asegurados:",null,{"$f":"+'AP Colectivo'!M14","v":0},null,"Días de Cobertura:",null,{"$f":"+'AP Colectivo'!Q14","v":0}]
[]
[null,"Muerte Accidental",null,null,null,null,null,null,{"$f":"+VLOOKUP(J8,'Coberturas AP - CV'!$A$2:$N$1048576,14,FALSE)","v":2.2000000000000002},{"$f":"+B2&B8&IF(AND(D5>0,D5<61),17,IF(AND(D5>60,D5<71),61,71))&$D$6","v":"AP IndividualMuerte Accidental17C"},null,"Muerte Accidental",null,null,null,null,{"$f":"+VLOOKUP(R8,'Coberturas AP - CV'!$A$220:$N$228,14,FALSE)","v":1.6},{"$f":"+L2&L8&IF(AND(N4>0,N4<61),17,IF(AND(N4>60,N4<71),61,71))&N5","v":"Colectivo de APMuerte Accidental17B"},null,null,null,"Muerte Accidental",null,null,null,null,{"$f":"+'Coberturas AP - CV'!$N$190","v":1},null,null,null,"Muerte Accidental",null,null,null,null,{"$f":"+VLOOKUP(AK8,'Coberturas AP - CV'!$A$372:$O$404,14,FALSE)","v":1},{"$f":"+AE2&AE8&AH4","v":"CruceroMuerte Accidental17"}]
[null,"Beneficio de Homicidio Doloso",null,null,null,null,null,null,{"$f":"IF(OR(D6=\"A\",D6=\"B\"),0.25,0.3)","v":0.3},null,null,"Beneficio de Homicidio Doloso",null,null,null,null,{"$f":"IF(OR(N5=\"A\",N5=\"B\"),0.25,0.3)","v":0.25},null,null,null,null,"Gastos Médicos por Accidente",null,null,null,null,{"$f":"+VLOOKUP(AB9,'Coberturas AP - CV'!A199:O214,15,FALSE)","v":{"$error":"#N/A"}},{"$f":"'Coberturas AP - CV'!M199&'Coberturas AP - CV'!B199&'AP PTA (Asiento)'!F19","v":"PasajeroGastos Médicos0"},null,null,"Gastos Médicos por Accidente",null,null,null,null,{"$f":"+VLOOKUP(AK9,'Coberturas AP - CV'!$A$372:$O$404,15,FALSE)","v":{"$error":"#N/A"}},{"$f":"+AE2&'Coberturas AP - CV'!B377&Crucero!F19","v":"CruceroGastos Médicos"}]
[null,"Gastos Médicos por Accidente",null,null,null,null,null,null,{"$f":"VLOOKUP('Coberturas AP - CV'!$B$29&'AP Individual'!$H$25&Calculador!$D$6,'Coberturas AP - CV'!$A$2:$S$130,15,FALSE)","v":{"$error":"#N/A"}},null,null,"Muerte en Transporte Público",null,null,null,null,{"$f":"+VLOOKUP(R10,'Coberturas AP - CV'!A232:N234,14,FALSE)","v":0.32},{"$f":"+L10&N5","v":"Muerte en Transporte PúblicoB"},null,null,null,"Renta Diaria por Incapacidad Temporal por Accidente",null,null,null,null,{"$f":"+'Coberturas AP - CV'!$N$217","v":2.5}]
{"$rows_left_out":45}
{"sheet":"CSG1960","index":15,"n_rows":48,"n_cols":4,"rows_kept":48,"cut":false,"hidden":true,"merged":[[0,0,0,3]]}
["TABLA CSG 1960  AL 50%"]
["Edad","Tasa Anual al 100%","Tasa Anual al 50%","Tasa Mensual al 50%"]
[20,2.09,1.0449999999999999,8.7083333333333332E-2]
[21,2.14,1.07,8.9166666666666672E-2]
[22,2.1800000000000002,1.0900000000000001,9.0833333333333335E-2]
[23,2.21,1.105,9.2083333333333336E-2]
[24,2.2400000000000002,1.1200000000000001,9.3333333333333338E-2]
[25,2.2599999999999998,1.1299999999999999,9.4166666666666662E-2]
[26,2.2799999999999998,1.1399999999999999,9.4999999999999987E-2]
[27,2.2999999999999998,1.1499999999999999,9.5833333333333326E-2]
{"$rows_left_out":38}